{"text_format":"1","workbook":"xlsx","n_sheets":23,"sheets":["Lists","CWE Market view","CWE Market graphs","CWE map","BorderDataOverview","Virgin domain initial comp.","PTDFs_Early Publication","LTN","PTDFs","Virgin domain final computation","ATCs","Max net pos","Max exchanges (Maxbex)","Shadow Auction ATC","Net Position","Allocated Capacities","Price Spread","Intraday ATC","Congestion Income","D2CF","Refprog","Final Flowbased domain","Intraday Implicit Allocation"],"not_rendered":{"charts":12,"images":1,"macros":1,"external_links":0,"defined_names":75,"comments":0,"pivot_tables":0},"unopened":[],"bounds":{"document_bytes":16777216,"sheet_cells":100000,"rows_first":2000,"rows_last":500,"rows_between":2000,"halvings":0,"cell_chars":16384,"cell_head_chars":4096},"cells_cut":0,"cells_raw":0,"read":"whole","date_system":"1900"}

{"sheet":"Lists","index":0,"n_rows":370,"n_cols":9,"rows_kept":370,"cut":false,"hidden":true,"merged":[]}
["Dates:",null,"Hours:",null,"Borders:",null,"Version:",null,"Refprog borders:"]
[{"$f":"A3+1","v":"2020-02-26"},null,1,null,"AT-DE",null,"4.1",null,"APG-CZ"]
[{"$f":"IF(G3=\"PR\",DATE(2015,5,19),TODAY())","v":"2020-02-25"},null,2,null,"AT-IT",null,"",null,"APG-HU"]
[{"$f":"IF(OR(A3-1>DATE(2015,5,19),$G$3=\"PR\"),A3-1,\"\")","v":"2020-02-24"},null,3,null,"AT-SI",null,"https://tennetnl-parallelrun-utilitytool.jao.eu/",null,"APG-SHB"]
[{"$f":"IF(A4=\"\",\"\",IF(OR(A4-1>DATE(2015,5,19),$G$3=\"PR\"),A4-1,\"\"))","v":"2020-02-23"},null,4,null,"BE-FR",null,null,null,"BE-NL"]
[{"$f":"IF(A5=\"\",\"\",IF(OR(A5-1>DATE(2015,5,19),$G$3=\"PR\"),A5-1,\"\"))","v":"2020-02-22"},null,5,null,"BE-NL",null,null,null,"BG-TR"]
[{"$f":"IF(A6=\"\",\"\",IF(OR(A6-1>DATE(2015,5,19),$G$3=\"PR\"),A6-1,\"\"))","v":"2020-02-21"},null,6,null,"DE-AT",null,null,null,"CH-APG"]
[{"$f":"IF(A7=\"\",\"\",IF(OR(A7-1>DATE(2015,5,19),$G$3=\"PR\"),A7-1,\"\"))","v":"2020-02-20"},null,7,null,"DE-DK1",null,null,null,"CH-DE+"]
[{"$f":"IF(A8=\"\",\"\",IF(OR(A8-1>DATE(2015,5,19),$G$3=\"PR\"),A8-1,\"\"))","v":"2020-02-19"},null,8,null,"DE-FR",null,null,null,"CH-FR"]
[{"$f":"IF(A9=\"\",\"\",IF(OR(A9-1>DATE(2015,5,19),$G$3=\"PR\"),A9-1,\"\"))","v":"2020-02-18"},null,9,null,"DE-NL",null,null,null,"CH-IT"]
{"$rows_left_out":361}
{"sheet":"CWE Market view","index":1,"n_rows":25,"n_cols":11,"rows_kept":25,"cut":false,"hidden":false,"merged":[[19,1,24,1],[10,5,10,6],[11,5,17,6],[20,5,24,5],[20,6,24,6],[10,1,17,1],[5,3,8,6],[5,8,8,10],[3,8,3,10],[3,3,3,6],[1,3,1,10]]}
[]
[null,null,null,"Utility Tool  "]
[]
[null,"Reference \ntime:",null,"1) Check volume (interactive module)",null,null,null,null,"2) Max volume (information module)"]
[]
[null,"date:",null,"Here you can check the simultaneous execution of trading volumes of the markets involved in the CWE Market Coupling",null,null,null,null,"Here you can find the maximal  trade volumes (MWh/h) which can be physically transported between two Hubs under the condition that no other trade is executed between other Hubs."]
[null,"2020-02-26"]
[null,"hour:"]
[null,"1"]
[]
{"$rows_left_out":16}
{"sheet":"CWE Market graphs","index":2,"n_rows":2,"n_cols":16,"rows_kept":2,"cut":false,"hidden":false,"merged":[[1,0,2,13],[1,15,2,25]]}
[]
["Maximum bilateral exchanges",null,null,null,null,null,null,null,null,null,null,null,null,null,null,"Maximum / minimum net positions"]

{"sheet":"CWE map","index":3,"n_rows":30,"n_cols":16,"rows_kept":30,"cut":false,"hidden":false,"merged":[[1,4,2,16]]}
[]
["data shown for hour:",null,null,null,"CWE max net positions and bilateral exchanges"]
[{"$f":"'CWE Market view'!B9","v":"1"}]
[]
[]
[null,null,null,null,null,"NL",null,null,null,null,null,null,"DE"]
[]
[null,null,null,null,{"$f":"'CWE Market view'!J17","v":0},"←",null,"export",{"$f":"'CWE Market view'!J25","v":0},null,"←",{"$f":"'CWE Market view'!J14","v":0}]
[null,null,null,null,{"$f":"'CWE Market view'!K17","v":0},"→",null,"import",{"$f":"'CWE Market view'!K25","v":0},null,null,{"$f":"'CWE Market view'!K14","v":0},"→"]
[]
{"$rows_left_out":21}
{"sheet":"BorderDataOverview","index":4,"n_rows":31,"n_cols":8,"rows_kept":31,"cut":false,"hidden":false,"merged":[]}
[]
["Date:","2019-02-15"]
[]
["Border:","FR-ES",null,"Choosing another Business Day on this sheet will also update the following sheets:"]
[null,null,null,"ATCs, Allocated Capacities, Price spread, Congestion Income, LTN, Shadow Auction ATC and ID ATC"]
["Hour","ATC (MW)","BEC (MW)","Price Spread (€/MWh)","Congestion Income (€)","LTN (MW)","Shadow Auction ATC (MW)","Intraday ATC (MW)"]
[{"$f":"IF(AND($B$2<>\"\",SUM(ATCs!A6,'Allocated Capacities'!A6,'Price Spread'!A6,LTN!A6,'Intraday ATC'!A7,'Shadow Auction ATC'!A6,'Congestion Income'!A7)>0),Lists!C2,\"\")","v":""},{"$f":"IF($A7<>\"\",HLOOKUP($B$4,ATCs!$B$5:$M$36,$A7+1,FALSE),\"\")","v":""},{"$f":"IF($A7<>\"\",HLOOKUP($B$4,'Allocated Capacities'!$B$5:$W$42,$A7+1,FALSE),\"\")","v":""},{"$f":"IF($A7<>\"\",HLOOKUP($B$4,'Price Spread'!$B$5:$W$41,$A7+1,FALSE),\"\")","v":""},{"$f":"IF($A7<>\"\",HLOOKUP($B$4,'Congestion Income'!$N$6:$Y$36,$A7+1,FALSE),\"\")","v":""},{"$f":"IF($A7<>\"\",HLOOKUP($B$4,LTN!$B$5:$K$34,$A7+1,FALSE),\"\")","v":""},{"$f":"IF($A7<>\"\",HLOOKUP($B$4,'Shadow Auction ATC'!$B$5:$K$36,$A7+1,FALSE),\"\")","v":""},{"$f":"IF($A7<>\"\",HLOOKUP($B$4,'Intraday ATC'!$B$6:$Q$38,$A7+1,FALSE),\"\")","v":""}]
[{"$f":"IF(AND($B$2<>\"\",SUM(ATCs!A7,'Allocated Capacities'!A7,'Price Spread'!A7,LTN!A7,'Intraday ATC'!A8,'Shadow Auction ATC'!A7,'Congestion Income'!A8)>0),Lists!C3,\"\")","v":""},{"$f":"IF($A8<>\"\",HLOOKUP($B$4,ATCs!$B$5:$M$36,$A8+1,FALSE),\"\")","v":""},{"$f":"IF($A8<>\"\",HLOOKUP($B$4,'Allocated Capacities'!$B$5:$W$42,$A8+1,FALSE),\"\")","v":""},{"$f":"IF($A8<>\"\",HLOOKUP($B$4,'Price Spread'!$B$5:$W$41,$A8+1,FALSE),\"\")","v":""},{"$f":"IF($A8<>\"\",HLOOKUP($B$4,'Congestion Income'!$N$6:$Y$36,$A8+1,FALSE),\"\")","v":""},{"$f":"IF($A8<>\"\",HLOOKUP($B$4,LTN!$B$5:$K$34,$A8+1,FALSE),\"\")","v":""},{"$f":"IF($A8<>\"\",HLOOKUP($B$4,'Shadow Auction ATC'!$B$5:$K$36,$A8+1,FALSE),\"\")","v":""},{"$f":"IF($A8<>\"\",HLOOKUP($B$4,'Intraday ATC'!$B$6:$Q$38,$A8+1,FALSE),\"\")","v":""}]
[{"$f":"IF(AND($B$2<>\"\",SUM(ATCs!A8,'Allocated Capacities'!A8,'Price Spread'!A8,LTN!A8,'Intraday ATC'!A9,'Shadow Auction ATC'!A8,'Congestion Income'!A9)>0),Lists!C4,\"\")","v":""},{"$f":"IF($A9<>\"\",HLOOKUP($B$4,ATCs!$B$5:$M$36,$A9+1,FALSE),\"\")","v":""},{"$f":"IF($A9<>\"\",HLOOKUP($B$4,'Allocated Capacities'!$B$5:$W$42,$A9+1,FALSE),\"\")","v":""},{"$f":"IF($A9<>\"\",HLOOKUP($B$4,'Price Spread'!$B$5:$W$41,$A9+1,FALSE),\"\")","v":""},{"$f":"IF($A9<>\"\",HLOOKUP($B$4,'Congestion Income'!$N$6:$Y$36,$A9+1,FALSE),\"\")","v":""},{"$f":"IF($A9<>\"\",HLOOKUP($B$4,LTN!$B$5:$K$34,$A9+1,FALSE),\"\")","v":""},{"$f":"IF($A9<>\"\",HLOOKUP($B$4,'Shadow Auction ATC'!$B$5:$K$36,$A9+1,FALSE),\"\")","v":""},{"$f":"IF($A9<>\"\",HLOOKUP($B$4,'Intraday ATC'!$B$6:$Q$38,$A9+1,FALSE),\"\")","v":""}]
[{"$f":"IF(AND($B$2<>\"\",SUM(ATCs!A9,'Allocated Capacities'!A9,'Price Spread'!A9,LTN!A9,'Intraday ATC'!A10,'Shadow Auction ATC'!A9,'Congestion Income'!A10)>0),Lists!C5,\"\")","v":""},{"$f":"IF($A10<>\"\",HLOOKUP($B$4,ATCs!$B$5:$M$36,$A10+1,FALSE),\"\")","v":""},{"$f":"IF($A10<>\"\",HLOOKUP($B$4,'Allocated Capacities'!$B$5:$W$42,$A10+1,FALSE),\"\")","v":""},{"$f":"IF($A10<>\"\",HLOOKUP($B$4,'Price Spread'!$B$5:$W$41,$A10+1,FALSE),\"\")","v":""},{"$f":"IF($A10<>\"\",HLOOKUP($B$4,'Congestion Income'!$N$6:$Y$36,$A10+1,FALSE),\"\")","v":""},{"$f":"IF($A10<>\"\",HLOOKUP($B$4,LTN!$B$5:$K$34,$A10+1,FALSE),\"\")","v":""},{"$f":"IF($A10<>\"\",HLOOKUP($B$4,'Shadow Auction ATC'!$B$5:$K$36,$A10+1,FALSE),\"\")","v":""},{"$f":"IF($A10<>\"\",HLOOKUP($B$4,'Intraday ATC'!$B$6:$Q$38,$A10+1,FALSE),\"\")","v":""}]
{"$rows_left_out":22}
{"sheet":"Virgin domain initial comp.","index":5,"n_rows":4,"n_cols":27,"rows_kept":4,"cut":false,"hidden":false,"merged":[]}
[]
["Date:","2019-05-21"]
[]
["FileId","DeliveryDate","Period","Row","OutageName","EIC_Code","CriticalBranchName","EIC_Code","Presolved","RemainingAvailableMargin","Fmax","Fref","FRM","FAV","AMR","AMR_Exclusion","AMR_ExclusionJustification","BiddingArea_Shortname","Factor","BiddingArea_Shortname","Factor","BiddingArea_Shortname","Factor","BiddingArea_Shortname","Factor","BiddingArea_Shortname","Factor"]

{"sheet":"PTDFs_Early Publication","index":6,"n_rows":9,"n_cols":15,"rows_kept":9,"cut":false,"hidden":false,"merged":[[7,13,8,13]]}
[]
["Date:","2020-02-26",null,""]
[]
[null,null,"AT-hub (MW)","BE-hub (MW)","DE-hub (MW)","FR-hub (MW)","NL-hub (MW)","Sum"]
[null,"Test Hub to Hub",{"$f":"-'CWE Market view'!E12","v":0},{"$f":"-'CWE Market view'!E13-'CWE Market view'!E16+'CWE Market view'!E18","v":0},{"$f":"'CWE Market view'!E12+'CWE Market view'!E13+'CWE Market view'!E14+'CWE Market view'!E15","v":0},{"$f":"-'CWE Market view'!E15-'CWE Market view'!E17-'CWE Market view'!E18","v":0},{"$f":"-'CWE Market view'!E14+'CWE Market view'!E16+'CWE Market view'!E17","v":0},{"$f":"SUM(C5:G5)","v":0}]
[null,"Test Hub Positions",{"$f":"'CWE Market view'!E21","v":0},{"$f":"'CWE Market view'!E23","v":0},{"$f":"'CWE Market view'!E22","v":0},{"$f":"'CWE Market view'!E24","v":0},{"$f":"'CWE Market view'!E25","v":0},{"$f":"SUM(C6:G6)","v":0}]
[]
[null,null,null,null,null,null,null,null,null,null,null,null,"Test Hub to Hub","# of constraints violated","Test Hub positions"]
[null,"ID","Critical Branch name","EIC code","Critical Outage name","EIC code","AT-hub","BE-hub","DE-hub","FR-hub","NL-hub","RAM (MW)",{"$f":"SUM(M10:M2000)","v":0},null,{"$f":"SUM(O10:O2000)","v":0}]

{"sheet":"LTN","index":7,"n_rows":5,"n_cols":11,"rows_kept":5,"cut":false,"hidden":false,"merged":[[3,1,3,10]]}
[]
["Date:","2020-02-26",null,""]
[]
[null,"LT Nominations (in MW)"]
["Hour","AT-DE","DE-AT","BE-NL","NL-BE","DE-NL","NL-DE","BE-FR","FR-BE","FR-DE","DE-FR"]

{"sheet":"PTDFs","index":8,"n_rows":6,"n_cols":15,"rows_kept":6,"cut":false,"hidden":false,"merged":[]}
[null,null,"AT-hub (MW)","BE-hub (MW)","DE-hub (MW)","FR-hub (MW)","NL-hub (MW)","Sum"]
[null,"Test Hub to Hub",{"$f":"-'CWE Market view'!E12","v":0},{"$f":"-'CWE Market view'!E13-'CWE Market view'!E16+'CWE Market view'!E18","v":0},{"$f":"'CWE Market view'!E12+'CWE Market view'!E13+'CWE Market view'!E14+'CWE Market view'!E15","v":0},{"$f":"-'CWE Market view'!E15-'CWE Market view'!E17-'CWE Market view'!E18","v":0},{"$f":"-'CWE Market view'!E14+'CWE Market view'!E16+'CWE Market view'!E17","v":0},{"$f":"SUM(C2:G2)","v":0}]
[null,"Test Hub Positions",{"$f":"'CWE Market view'!E21","v":0},{"$f":"'CWE Market view'!E23","v":0},{"$f":"'CWE Market view'!E22","v":0},{"$f":"'CWE Market view'!E24","v":0},{"$f":"'CWE Market view'!E25","v":0},{"$f":"SUM(C3:G3)","v":0}]
[]
[null,null,null,null,null,null,null,null,null,null,null,null,"Test Hub to Hub","# of constraints violated","Test Hub positions"]
[null,"ID","Critical Branch name","EIC code","Critical Outage name","EIC code","AT-hub","BE-hub","DE-hub","FR-hub","NL-hub","RAM (MW)",{"$f":"SUM(M7:M2000)","v":0},null,{"$f":"SUM(O7:O2000)","v":0}]

{"sheet":"Virgin domain final computation","index":9,"n_rows":4,"n_cols":27,"rows_kept":4,"cut":false,"hidden":false,"merged":[]}
[]
["Date:","2019-05-21",null,"An error has occured"]
[]
["FileId","DeliveryDate","Period","Row","OutageName","EIC_Code","CriticalBranchName","EIC_Code","Presolved","RemainingAvailableMargin","Fmax","Fref","FRM","FAV","AMR","AMR_Exclusion","AMR_ExclusionJustification","BiddingArea_Shortname","Factor","BiddingArea_Shortname","Factor","BiddingArea_Shortname","Factor","BiddingArea_Shortname","Factor","BiddingArea_Shortname","Factor"]

{"sheet":"ATCs","index":10,"n_rows":5,"n_cols":23,"rows_kept":5,"cut":false,"hidden":false,"merged":[[3,1,3,22]]}
[]
["Date:","2020-02-26",null,""]
[]
[null,"ATC (in MW)"]
["Hour","FR-ES","ES-FR","DK1-DE","DE-DK1","FR-IT","IT-FR","AT-IT","IT-AT","SI-IT","IT-SI","SI-AT","AT-SI","SI-HR","HR-SI","BE-GB","GB-BE","DE-D2","D2-DE","DK-NL","NL-DK","NO-NL","NL-NO"]

{"sheet":"Max net pos","index":11,"n_rows":1,"n_cols":19,"rows_kept":1,"cut":false,"hidden":false,"merged":[[141,0,150,0],[241,0,250,0],[1,0,10,0],[11,0,20,0],[21,0,30,0],[31,0,40,0],[41,0,50,0],[51,0,60,0],[61,0,70,0],[71,0,80,0],[81,0,90,0],[91,0,100,0],[101,0,110,0],[111,0,120,0],[121,0,130,0],[131,0,140,0],[211,0,220,0],[221,0,230,0],[231,0,240,0],[151,0,160,0],[161,0,170,0],[171,0,180,0],[181,0,190,0],[191,0,200,0],[201,0,210,0]]}
[null,"Prog","AT","BE","DE","FR","NL",null,"hour","Min AT","Max AT","Min BE","Max BE","Min DE","Max DE","Min FR","Max FR","Min NL","Max NL"]

{"sheet":"Max exchanges (Maxbex)","index":12,"n_rows":1,"n_cols":25,"rows_kept":1,"cut":false,"hidden":false,"merged":[[281,0,300,0],[481,0,500,0],[1,0,20,0],[21,0,40,0],[41,0,60,0],[61,0,80,0],[81,0,100,0],[101,0,120,0],[121,0,140,0],[141,0,160,0],[161,0,180,0],[181,0,200,0],[201,0,220,0],[221,0,240,0],[241,0,260,0],[261,0,280,0],[421,0,440,0],[441,0,460,0],[461,0,480,0],[301,0,320,0],[321,0,340,0],[341,0,360,0],[361,0,380,0],[381,0,400,0],[401,0,420,0]]}
[null,"Direction","Exchange",null,"hour","Max AT=>BE","Max AT=>DE","Max AT=>FR","Max AT=>NL","Max BE=>AT","Max BE=>DE","Max BE=>FR","Max BE=>NL","Max DE=>AT","Max DE=>BE","Max DE=>FR","Max DE=>NL","Max FR=>AT","Max FR=>BE","Max FR=>DE","Max FR=>NL","Max NL=>AT","Max NL=>BE","Max NL=>DE","Max NL=>FR"]

{"sheet":"Shadow Auction ATC","index":13,"n_rows":5,"n_cols":11,"rows_kept":5,"cut":false,"hidden":false,"merged":[[3,1,3,10]]}
[]
["Date:","2020-02-26",null,""]
[]
[null,"Shadow Auction ATC (in MW)"]
["Hour","AT-DE","DE-AT","BE-NL","NL-BE","DE-NL","NL-DE","BE-FR","FR-BE","FR-DE","DE-FR"]

{"sheet":"Net Position","index":14,"n_rows":5,"n_cols":7,"rows_kept":5,"cut":false,"hidden":false,"merged":[[3,1,3,5]]}
[]
["Date:","2020-02-26",null,""]
[]
[null,"Internal CWE Net Position (in MW)",null,null,null,null,"Import (-)     Export (+)"]
["Hour","AT","BE","DE","FR","NL"]

{"sheet":"Allocated Capacities","index":15,"n_rows":5,"n_cols":25,"rows_kept":5,"cut":false,"hidden":false,"merged":[[3,1,3,24]]}
[]
["Date:","2020-02-26",null,""]
[]
[null,"Bilateral Exchanges (in MW)"]
["Hour","AT-DE","DE-AT","FR-ES","ES-FR","DK1-DE","DE-DK1","BE-NL","NL-BE","DE-NL","NL-DE","BE-FR","FR-BE","FR-DE","DE-FR","FR-IT","IT-FR","AT-IT","IT-AT","SI-IT","IT-SI","SI-AT","AT-SI","SI-HR","HR-SI"]

{"sheet":"Price Spread","index":16,"n_rows":5,"n_cols":29,"rows_kept":5,"cut":false,"hidden":false,"merged":[[3,1,3,24],[3,25,3,28]]}
[]
["Date:","2020-02-26",null,""]
[]
[null,"Price Spread (in €/MWh)",null,null,null,null,null,null,null,null,null,null,null,null,null,null,null,null,null,null,null,null,null,null,null,"Loss-Adjusted Market Spread (in €/MWh)"]
["Hour","AT-DE","DE-AT","FR-ES","ES-FR","DK1-DE","DE-DK1","BE-NL","NL-BE","DE-NL","NL-DE","BE-FR","FR-BE","FR-DE","DE-FR","FR-IT","IT-FR","AT-IT","IT-AT","SI-IT","IT-SI","SI-AT","AT-SI","SI-HR","HR-SI","GB-IE","IE-GB","GB-NI","NI-GB"]

{"sheet":"Intraday ATC","index":17,"n_rows":6,"n_cols":21,"rows_kept":6,"cut":false,"hidden":false,"merged":[[2,2,2,12],[5,17,5,18],[5,19,5,20],[3,1,3,20],[5,1,5,2],[5,15,5,16],[5,13,5,14],[5,11,5,12],[5,9,5,10],[5,7,5,8],[5,5,5,6],[5,3,5,4]]}
[]
["Date:","2020-02-26",null,""]
[null,null,"Please note that the capacity values published here are the result of an automatic process using the day ahead flow based domain and the day ahead market clearing point. \nThese values do not necessarily represent the capacities being made available for intraday trading as they are published at a time when TSOs have not yet performed \ntheir grid analysis and capacity calculation processes based on the day ahead market results as day ahead left-overs and are therefore without commitment. \nAs soon as those processes are completed the TSOs will publish the final capacities available for intraday trading on the ENTSOE transparency platform."]
[null,"Intraday ATC (in MW)"]
["Hour","Initial","Increase/Decrease","Initial","Increase/Decrease","Initial","Increase/Decrease","Initial","Increase/Decrease","Initial","Increase/Decrease","Initial","Increase/Decrease","Initial","Increase/Decrease","Initial","Increase/Decrease","Initial","Increase/Decrease","Initial","Increase/Decrease"]
[null,"AT-DE",null,"DE-AT",null,"BE-NL",null,"NL-BE",null,"DE-NL",null,"NL-DE",null,"BE-FR",null,"FR-BE",null,"FR-DE",null,"DE-FR"]

{"sheet":"Congestion Income","index":18,"n_rows":6,"n_cols":27,"rows_kept":6,"cut":false,"hidden":false,"merged":[[4,1,4,5],[4,6,4,12],[3,1,3,26],[4,13,4,26]]}
[]
["Date:","2020-02-26",null,""]
[]
[null,"Congestion Income (in €)"]
[null,"Net Congestion Income Per Hub",null,null,null,null,"Net Congestion Income per TSO",null,null,null,null,null,null,"Gross Congestion Income per Border"]
["Hour","AT","BE","DE","FR","NL","Amprion","APG","Elia","RTE","Tennet BV","TenneT Gmbh","Transnet","DE-DK1","DK1-DE","FR-ES","ES-FR","FR-IT","IT-FR","AT-IT","IT-AT","SI-IT","IT-SI","SI-AT","AT-SI","SI-HR","HR-SI"]

{"sheet":"D2CF","index":19,"n_rows":6,"n_cols":43,"rows_kept":6,"cut":false,"hidden":false,"merged":[[5,40,5,42],[3,16,3,42],[3,1,3,15],[4,1,4,5],[4,6,4,10],[4,11,4,15],[5,28,5,30],[5,31,5,33],[5,34,5,36],[5,37,5,39],[5,16,5,18],[5,19,5,21],[5,22,5,24],[5,25,5,27]]}
[]
["Date:","2020-02-26",null,""]
[]
[null,"D2CF per Hub (in MW)",null,null,null,null,null,null,null,null,null,null,null,null,null,null,"D2CF per TSO (in MW)"]
[null,"Vertical load",null,null,null,null,"Generation",null,null,null,null,"Best Forecast Net Positions ",null,null,null,null,"VertLoad","Gen","BFNP","VertLoad","Gen","BFNP","VertLoad","Gen","BFNP","VertLoad","Gen","BFNP","VertLoad","Gen","BFNP","VertLoad","Gen","BFNP","VertLoad","Gen","BFNP","VertLoad","Gen","BFNP","VertLoad","Gen","BFNP"]
["TimeStamps","AT","BE","DE","FR","NL","AT","BE","DE","FR","NL","AT","BE","DE","FR","NL","APG",null,null,"TenneT GmbH",null,null,"Transnet BW",null,null,"Amprion",null,null,"50Hertz",null,null,"Elia",null,null,"RTE",null,null,"TenneT BV",null,null,"Creos"]

{"sheet":"Refprog","index":20,"n_rows":12,"n_cols":15,"rows_kept":12,"cut":false,"hidden":false,"merged":[[3,1,3,11]]}
[]
["Date:","2020-02-26",null,""]
[]
[null,"Refprog Bilateral Exchanges (in MW)"]
["Hour","BE-NL","DE-NL","FR-BE","FR-DE","FR-ES","FR-IT","CH-DE","CH-FR","DE-CZ","DE-PL","APG-CZ","q"]
[null,null,null,null,null,null,null,null,null,null,null,null,null,null,"Notes for extra borders:"]
[]
[null,null,null,null,null,null,null,null,null,null,null,null,null,null,"WPS: part of Ukraine"]
[null,null,null,null,null,null,null,null,null,null,null,null,null,null,"Zone ES+ includes ES and MA"]
[null,null,null,null,null,null,null,null,null,null,null,null,null,null,"Zone DE+ includes DE, DKw and Luxemburg"]
{"$rows_left_out":3}
{"sheet":"Final Flowbased domain","index":21,"n_rows":4,"n_cols":27,"rows_kept":4,"cut":false,"hidden":false,"merged":[]}
[]
["Date:","2019-05-21"]
[]
["FileId","DeliveryDate","Period","Row","OutageName","EIC_Code","CriticalBranchName","EIC_Code","Presolved","RemainingAvailableMargin (MW)","Fmax","Fref","FRM","FAV","AMR","AMR_Exclusion","AMR_ExclusionJustification","BiddingArea_Shortname","Factor","BiddingArea_Shortname","Factor","BiddingArea_Shortname","Factor","BiddingArea_Shortname","Factor","BiddingArea_Shortname","Factor"]

{"sheet":"Intraday Implicit Allocation","index":22,"n_rows":6,"n_cols":13,"rows_kept":6,"cut":false,"hidden":false,"merged":[[3,9,3,12],[4,9,4,10],[4,11,4,12],[3,1,3,4],[3,5,3,8],[4,1,4,2],[4,3,4,4],[4,5,4,6],[4,7,4,8]]}
[]
["Date:","2020-02-26",null,""]
[]
[null,"Bilateral Exchanges (in MW)",null,null,null,"Price Spread (in €/MWh)",null,null,null,"Gross Congestion Income (in €)"]
[null,"Intraday 1",null,"Intraday 2",null,"Intraday 1",null,"Intraday 2",null,"Intraday 1",null,"Intraday 2"]
["Hour","CH-IT","IT-CH","CH-IT","IT-CH","CH-IT","IT-CH","CH-IT","IT-CH","CH-IT","IT-CH","CH-IT","IT-CH"]